Reaction Details
TargetCannabinoid receptor 1
LigandBDBM50296168
Substrate/Competitorn/a
Meas. Tech.ChEMBL_579533 (CHEMBL1059680)
Ki 3949±n/a nM
Citation Foloppe, NBenwell, KBrooks, TDKennett, GKnight, ARMisra, AMonck, NJ Discovery and functional evaluation of diverse novel human CB(1) receptor ligands. Bioorg Med Chem Lett19:4183-90 (2009) 
 
Cannabinoid receptor 1
Name:Cannabinoid receptor 1
Type:G Protein-Coupled Receptor (GPCR)
Mol. Mass.:52868.96
Organism:Homo sapiens (Human)
Description:P21554
Residue:472
BDBM50296168
NameBDBM50296168
Synonyms:4-(8-benzyl-5-cyano-3,3-dimethyl-3,4-dihydro-1H-pyrano[3,4-c]pyridin-6-yl)-N-propylpiperazine-1-carboxamide | CHEMBL559476
TypeSmall organic molecule
Emp. Form.C26H33N5O2
Mol. Mass.447.5725
SMILESCCCNC(=O)N1CCN(CC1)c1nc(Cc2ccccc2)c2COC(C)(C)Cc2c1C#N