Reaction Details
TargetCannabinoid receptor 1
LigandBDBM50296169
Substrate/Competitorn/a
Meas. Tech.ChEMBL_579533 (CHEMBL1059680)
Ki 7490±n/a nM
Citation Foloppe, NBenwell, KBrooks, TDKennett, GKnight, ARMisra, AMonck, NJ Discovery and functional evaluation of diverse novel human CB(1) receptor ligands. Bioorg Med Chem Lett19:4183-90 (2009) 
 
Cannabinoid receptor 1
Name:Cannabinoid receptor 1
Type:G Protein-Coupled Receptor (GPCR)
Mol. Mass.:52868.96
Organism:Homo sapiens (Human)
Description:P21554
Residue:472
BDBM50296169
NameBDBM50296169
Synonyms:3-(4-tert-butylbenzoyl)-2-(3-fluorophenyl)-N-(pyridin-2-ylmethyl)thiazolidine-4-carboxamide | CHEMBL555869
TypeSmall organic molecule
Emp. Form.C27H28FN3O2S
Mol. Mass.477.594
SMILESCC(C)(C)c1ccc(cc1)C(=O)N1C(CSC1c1cccc(F)c1)C(=O)NCc1ccccn1