Reaction Details
TargetCannabinoid receptor 2
LigandBDBM50200841
Substrate/Competitorn/a
Meas. Tech.ChEMBL_579534 (CHEMBL1059681)
Ki 290±n/a nM
Citation Foloppe, NBenwell, KBrooks, TDKennett, GKnight, ARMisra, AMonck, NJ Discovery and functional evaluation of diverse novel human CB(1) receptor ligands. Bioorg Med Chem Lett19:4183-90 (2009) 
 
Cannabinoid receptor 2
Name:Cannabinoid receptor 2
Type:G Protein-Coupled Receptor (GPCR)
Mol. Mass.:39690.94
Organism:Homo sapiens (Human)
Description:P34972
Residue:360
BDBM50200841
NameBDBM50200841
Synonyms:CHEMBL220360 MK-0634 N-[(1S,2S)-3-(4-chlorophenyl)-2-(3-cyanophenyl)-1-methylpropyl]-2-methyl-2-{[5-(trifluoromethyl)pyridin-2-yl]oxy}propanamide Taranbant
TypeSmall organic molecule
Emp. Form.C27H25ClF3N3O2
Mol. Mass.515.955
SMILESC[C@H](NC(=O)C(C)(C)Oc1ccc(cn1)C(F)(F)F)[C@@H](Cc1ccc(Cl)cc1)c1cccc(c1)C#N