Reaction Details
TargetCannabinoid receptor 2
LigandBDBM50296143
Substrate/Competitorn/a
Meas. Tech.ChEMBL_579534 (CHEMBL1059681)
Ki 10000±n/a nM
Citation Foloppe, NBenwell, KBrooks, TDKennett, GKnight, ARMisra, AMonck, NJ Discovery and functional evaluation of diverse novel human CB(1) receptor ligands. Bioorg Med Chem Lett19:4183-90 (2009) 
 
Cannabinoid receptor 2
Name:Cannabinoid receptor 2
Type:G Protein-Coupled Receptor (GPCR)
Mol. Mass.:39690.94
Organism:Homo sapiens (Human)
Description:P34972
Residue:360
BDBM50296143
NameBDBM50296143
Synonyms:4-(indolin-1-ylsulfonyl)-N-(2-phenoxyphenyl)benzamide | CHEMBL560462
TypeSmall organic molecule
Emp. Form.C27H22N2O4S
Mol. Mass.470.54
SMILESO=C(Nc1ccccc1Oc1ccccc1)c1ccc(cc1)S(=O)(=O)N1CCc2ccccc12