Reaction Details
TargetCannabinoid receptor 1
LigandBDBM50296146
Substrate/Competitorn/a
Meas. Tech.ChEMBL_579533 (CHEMBL1059680)
Ki 287±n/a nM
Citation Foloppe, NBenwell, KBrooks, TDKennett, GKnight, ARMisra, AMonck, NJ Discovery and functional evaluation of diverse novel human CB(1) receptor ligands. Bioorg Med Chem Lett19:4183-90 (2009) 
 
Cannabinoid receptor 1
Name:Cannabinoid receptor 1
Type:G Protein-Coupled Receptor (GPCR)
Mol. Mass.:52868.96
Organism:Homo sapiens (Human)
Description:P21554
Residue:472
BDBM50296146
NameBDBM50296146
Synonyms:CHEMBL557921 | ethyl 4-(3-(2-chlorophenyl)-1-(2,4-dimethylphenyl)-1H-pyrazole-5-carbonyl)piperazine-1-carboxylate
TypeSmall organic molecule
Emp. Form.C25H27ClN4O3
Mol. Mass.466.96
SMILESCCOC(=O)N1CCN(CC1)C(=O)c1cc(nn1-c1ccc(C)cc1C)-c1ccccc1Cl