Reaction Details
TargetMuscarinic acetylcholine receptor M1
LigandBDBM50296338
Substrate/Competitorn/a
Meas. Tech.ChEMBL_581960 (CHEMBL1058940)
IC50 0.28±n/a nM
Citation Prat, MFernández, DBuil, MACrespo, MICasals, GFerrer, MTort, LCastro, JMonleón, JMGavaldà, AMiralpeix, MRamos, IDoménech, TVilella, DAntón, FHuerta, JMEspinosa, SLópez, MSentellas, SGonzález, MAlbertí, JSegarra, VCárdenas, ABeleta, JRyder, H Discovery of novel quaternary ammonium derivatives of (3R)-quinuclidinol esters as potent and long-acting muscarinic antagonists with potential for minimal systemic exposure after inhaled administration: identification of (3R)-3-{[hydroxy(di-2-thienyl)acetyl]oxy}-1-(3-phenoxypropyl)-1-azoniabicyclo J Med Chem52:5076-92 (2010) 
 
Muscarinic acetylcholine receptor M1
Name:Muscarinic acetylcholine receptor M1
Type:Protein
Mol. Mass.:51442.54
Organism:Homo sapiens (Human)
Description:P11229
Residue:460
BDBM50296338
NameBDBM50296338
Synonyms:(3R)-3-{[(9-Methyl-9H-xanthen-9-yl)carbonyl]oxy}-1-(3-phenoxypropyl)-1-azoniabicyclo[2.2.2]octane bromide US9333195, 146
TypeSmall organic molecule
Emp. Form.C31H34NO4
Mol. Mass.484.6054
SMILESCC1(C(=O)O[C@H]2C[N+]3(CCCOc4ccccc4)CCC2CC3)c2ccccc2Oc2ccccc12