Reaction Details
TargetMuscarinic acetylcholine receptor M2
LigandBDBM50296324
Substrate/Competitorn/a
Meas. Tech.ChEMBL_581961 (CHEMBL1058941)
IC50 2.24±n/a nM
Citation Prat, MFernández, DBuil, MACrespo, MICasals, GFerrer, MTort, LCastro, JMonleón, JMGavaldà, AMiralpeix, MRamos, IDoménech, TVilella, DAntón, FHuerta, JMEspinosa, SLópez, MSentellas, SGonzález, MAlbertí, JSegarra, VCárdenas, ABeleta, JRyder, H Discovery of novel quaternary ammonium derivatives of (3R)-quinuclidinol esters as potent and long-acting muscarinic antagonists with potential for minimal systemic exposure after inhaled administration: identification of (3R)-3-{[hydroxy(di-2-thienyl)acetyl]oxy}-1-(3-phenoxypropyl)-1-azoniabicyclo J Med Chem52:5076-92 (2010) 
 
Muscarinic acetylcholine receptor M2
Name:Muscarinic acetylcholine receptor M2
Type:GPCR
Mol. Mass.:51730.61
Organism:Homo sapiens (Human)
Description:P08172
Residue:466
BDBM50296324
NameBDBM50296324
Synonyms:(3R)-3-{[(9-Hydroxy-9H-fluoren-9-yl)carbonyl]oxy}-1-(2-phenylethyl)-1-azoniabicyclo[2.2.2]octane bromide US9333195, 101
TypeSmall organic molecule
Emp. Form.C29H30NO3
Mol. Mass.440.5529
SMILESOC1(C(=O)O[C@H]2C[N+]3(CCc4ccccc4)CCC2CC3)c2ccccc2-c2ccccc12