Reaction Details
TargetMuscarinic acetylcholine receptor M2
LigandBDBM50296340
Substrate/Competitorn/a
Meas. Tech.ChEMBL_581961 (CHEMBL1058941)
IC50 0.35±n/a nM
Citation Prat, MFernández, DBuil, MACrespo, MICasals, GFerrer, MTort, LCastro, JMonleón, JMGavaldà, AMiralpeix, MRamos, IDoménech, TVilella, DAntón, FHuerta, JMEspinosa, SLópez, MSentellas, SGonzález, MAlbertí, JSegarra, VCárdenas, ABeleta, JRyder, H Discovery of novel quaternary ammonium derivatives of (3R)-quinuclidinol esters as potent and long-acting muscarinic antagonists with potential for minimal systemic exposure after inhaled administration: identification of (3R)-3-{[hydroxy(di-2-thienyl)acetyl]oxy}-1-(3-phenoxypropyl)-1-azoniabicyclo J Med Chem52:5076-92 (2010) 
 
Muscarinic acetylcholine receptor M2
Name:Muscarinic acetylcholine receptor M2
Type:GPCR
Mol. Mass.:51730.61
Organism:Homo sapiens (Human)
Description:P08172
Residue:466
BDBM50296340
NameBDBM50296340
Synonyms:(3R)-3-[(Di-2-thienylacetyl)oxy]-1-(3-phenoxypropyl)-1-azoniabicyclo[2.2.2]octane bromide US9333195, 35 | US9687478, 35
TypeSmall organic molecule
Emp. Form.C26H30NO3S2
Mol. Mass.468.651
SMILESO=C(O[C@H]1C[N+]2(CCCOc3ccccc3)CCC1CC2)C(c1cccs1)c1cccs1