Reaction Details
TargetMuscarinic acetylcholine receptor M3
LigandBDBM50296329
Substrate/Competitorn/a
Meas. Tech.ChEMBL_581962 (CHEMBL1058942)
IC50 0.2±n/a nM
Citation Prat, MFernández, DBuil, MACrespo, MICasals, GFerrer, MTort, LCastro, JMonleón, JMGavaldà, AMiralpeix, MRamos, IDoménech, TVilella, DAntón, FHuerta, JMEspinosa, SLópez, MSentellas, SGonzález, MAlbertí, JSegarra, VCárdenas, ABeleta, JRyder, H Discovery of novel quaternary ammonium derivatives of (3R)-quinuclidinol esters as potent and long-acting muscarinic antagonists with potential for minimal systemic exposure after inhaled administration: identification of (3R)-3-{[hydroxy(di-2-thienyl)acetyl]oxy}-1-(3-phenoxypropyl)-1-azoniabicyclo J Med Chem52:5076-92 (2010) 
 
Muscarinic acetylcholine receptor M3
Name:Muscarinic acetylcholine receptor M3
Type:Enzyme
Mol. Mass.:66151.03
Organism:Homo sapiens (Human)
Description:P20309
Residue:590
BDBM50296329
NameBDBM50296329
Synonyms:(3R)-3-{[Hydroxy(di-2-thienyl)acetyl]oxy}-1-(2-phenylethyl)-1-azoniabicyclo[2.2.2]octane bromide US9333195, 36 | US9687478, 36
TypeSmall organic molecule
Emp. Form.C25H28NO3S2
Mol. Mass.454.624
SMILESOC(C(=O)O[C@H]1C[N+]2(CCc3ccccc3)CCC1CC2)(c1cccs1)c1cccs1