Reaction Details
TargetMuscarinic acetylcholine receptor M1
LigandBDBM50296322
Substrate/Competitorn/a
Meas. Tech.ChEMBL_581960 (CHEMBL1058940)
IC50 0.24±n/a nM
Citation Prat, MFernández, DBuil, MACrespo, MICasals, GFerrer, MTort, LCastro, JMonleón, JMGavaldà, AMiralpeix, MRamos, IDoménech, TVilella, DAntón, FHuerta, JMEspinosa, SLópez, MSentellas, SGonzález, MAlbertí, JSegarra, VCárdenas, ABeleta, JRyder, H Discovery of novel quaternary ammonium derivatives of (3R)-quinuclidinol esters as potent and long-acting muscarinic antagonists with potential for minimal systemic exposure after inhaled administration: identification of (3R)-3-{[hydroxy(di-2-thienyl)acetyl]oxy}-1-(3-phenoxypropyl)-1-azoniabicyclo J Med Chem52:5076-92 (2010) 
 
Muscarinic acetylcholine receptor M1
Name:Muscarinic acetylcholine receptor M1
Type:Protein
Mol. Mass.:51442.54
Organism:Homo sapiens (Human)
Description:P11229
Residue:460
BDBM50296322
NameBDBM50296322
Synonyms:(3R)-1-Azabicyclo[2.2.2]oct-3-yl(2R)-cyclopentyl(hydroxy)2-thienylacetate | CHEMBL554699
TypeSmall organic molecule
Emp. Form.C18H25NO3S
Mol. Mass.335.461
SMILESO[C@](C1CCCC1)(C(=O)O[C@H]1CN2CCC1CC2)c1cccs1