Reaction Details
TargetInsulin-like growth factor 1 receptor
LigandBDBM50296355
Substrate/Competitorn/a
Meas. Tech.ChEMBL_582003 (CHEMBL1055740)
IC50 80±n/a nM
Citation Li, RPourpak, AMorris, SW Inhibition of the insulin-like growth factor-1 receptor (IGF1R) tyrosine kinase as a novel cancer therapy approach. J Med Chem52:4981-5004 (2010) 
 
Insulin-like growth factor 1 receptor
Name:Insulin-like growth factor 1 receptor
Type:Protein
Mol. Mass.:154776.79
Organism:Homo sapiens (Human)
Description:P08069
Residue:1367
BDBM50296355
NameBDBM50296355
Synonyms:CHEMBL553443 | N-(2-(5-(3,5-difluorophenylsulfonyl)-4,5,6,7-tetrahydro-1H-pyrazolo[4,3-c]pyridin-3-ylcarbamoyl)-5-(4-methylpiperazin-1-yl)phenyl)-1H-pyrrole-2-carboxamide
TypeSmall organic molecule
Emp. Form.C29H30F2N8O4S
Mol. Mass.624.662
SMILESCN1CCN(CC1)c1ccc(C(=O)Nc2[nH]nc3CCN(Cc23)S(=O)(=O)c2cc(F)cc(F)c2)c(NC(=O)c2ccc[nH]2)c1