Reaction Details
TargetInsulin-like growth factor 1 receptor
LigandBDBM50296352
Substrate/Competitorn/a
Meas. Tech.ChEMBL_581978 (CHEMBL1058958)
IC50 19±n/a nM
Citation Li, RPourpak, AMorris, SW Inhibition of the insulin-like growth factor-1 receptor (IGF1R) tyrosine kinase as a novel cancer therapy approach. J Med Chem52:4981-5004 (2010) 
 
Insulin-like growth factor 1 receptor
Name:Insulin-like growth factor 1 receptor
Type:Protein
Mol. Mass.:154776.79
Organism:Homo sapiens (Human)
Description:P08069
Residue:1367
BDBM50296352
NameBDBM50296352
Synonyms:1-(8-(3-(4-methylpiperazin-1-yl)cyclobutyl)-2-phenylquinolin-7-yl)imidazo[1,5-a]pyrazin-8-amine | CHEMBL551263
TypeSmall organic molecule
Emp. Form.C30H31N7
Mol. Mass.489.614
SMILESCN1CCN(CC1)C1CC(C1)c1c(ccc2ccc(nc12)-c1ccccc1)-c1ncn2ccnc(N)c12