Reaction Details
TargetInsulin-like growth factor 1 receptor
LigandBDBM50296353
Substrate/Competitorn/a
Meas. Tech.ChEMBL_581989 (CHEMBL1058969)
IC50 20±n/a nM
Citation Li, RPourpak, AMorris, SW Inhibition of the insulin-like growth factor-1 receptor (IGF1R) tyrosine kinase as a novel cancer therapy approach. J Med Chem52:4981-5004 (2010) 
 
Insulin-like growth factor 1 receptor
Name:Insulin-like growth factor 1 receptor
Type:Protein
Mol. Mass.:154776.79
Organism:Homo sapiens (Human)
Description:P08069
Residue:1367
BDBM50296353
NameBDBM50296353
Synonyms:1-(8-(3-(aziridin-1-yl)cyclobutyl)-2-phenylquinolin-7-yl)imidazo[1,5-a]pyrazin-8-amine | CHEMBL551524
TypeSmall organic molecule
Emp. Form.C27H24N6
Mol. Mass.432.5197
SMILESNc1nccn2cnc(-c3ccc4ccc(nc4c3C3CC(C3)N3CC3)-c3ccccc3)c12