Reaction Details
TargetInsulin-like growth factor 1 receptor
LigandBDBM50296354
Substrate/Competitorn/a
Meas. Tech.ChEMBL_582000 (CHEMBL1055737)
IC50 3050±n/a nM
Citation Li, RPourpak, AMorris, SW Inhibition of the insulin-like growth factor-1 receptor (IGF1R) tyrosine kinase as a novel cancer therapy approach. J Med Chem52:4981-5004 (2010) 
 
Insulin-like growth factor 1 receptor
Name:Insulin-like growth factor 1 receptor
Type:Protein
Mol. Mass.:154776.79
Organism:Homo sapiens (Human)
Description:P08069
Residue:1367
BDBM50296354
NameBDBM50296354
Synonyms:CHEMBL549369 | N-(5-(3,5-difluorophenylsulfonyl)-4,5,6,7-tetrahydro-1H-pyrazolo[4,3-c]pyridin-3-yl)-4-(4-methylpiperazin-1-yl)benzamide
TypeSmall organic molecule
Emp. Form.C24H26F2N6O3S
Mol. Mass.516.563
SMILESCN1CCN(CC1)c1ccc(cc1)C(=O)Nc1[nH]nc2CCN(Cc12)S(=O)(=O)c1cc(F)cc(F)c1