Reaction Details
TargetInsulin-like growth factor 1 receptor
LigandBDBM50296357
Substrate/Competitorn/a
Meas. Tech.ChEMBL_581989 (CHEMBL1058969)
IC50 170±n/a nM
Citation Li, RPourpak, AMorris, SW Inhibition of the insulin-like growth factor-1 receptor (IGF1R) tyrosine kinase as a novel cancer therapy approach. J Med Chem52:4981-5004 (2010) 
 
Insulin-like growth factor 1 receptor
Name:Insulin-like growth factor 1 receptor
Type:Protein
Mol. Mass.:154776.79
Organism:Homo sapiens (Human)
Description:P08069
Residue:1367
BDBM50296357
NameBDBM50296357
Synonyms:4,4'-(benzo[d][1,3]dioxol-5-ylazanediyl)bis(methylene)dibenzene-1,2-diol | CHEMBL551264
TypeSmall organic molecule
Emp. Form.C21H19NO6
Mol. Mass.381.3787
SMILESOc1ccc(CN(Cc2ccc(O)c(O)c2)c2ccc3OCOc3c2)cc1O