Reaction Details
TargetNeuronal acetylcholine receptor subunit alpha-7
LigandBDBM50296713
Substrate/Competitorn/a
Meas. Tech.ChEMBL_582484 (CHEMBL1058161)
Ki 13±n/a nM
Citation O'Donnell, CJPeng, LO'Neill, BTArnold, EPMather, RJSands, SBShrikhande, ALebel, LASpracklin, DKNedza, FM Synthesis and SAR studies of 1,4-diazabicyclo[3.2.2]nonane phenyl carbamates--subtype selective, high affinity alpha7 nicotinic acetylcholine receptor agonists. Bioorg Med Chem Lett19:4747-51 (2009) 
 
Neuronal acetylcholine receptor subunit alpha-7
Name:Neuronal acetylcholine receptor subunit alpha-7
Type:Enzyme
Mol. Mass.:56502.44
Organism:Rattus norvegicus (Rat)
Description:Q05941
Residue:502
BDBM50296713
NameBDBM50296713
Synonyms:3-phenoxyphenyl 1,4-diazabicyclo[3.2.2]nonane-4-carboxylate | CHEMBL554400
TypeSmall organic molecule
Emp. Form.C20H22N2O3
Mol. Mass.338.4003
SMILESO=C(Oc1cccc(Oc2ccccc2)c1)N1CCN2CCC1CC2