Reaction Details
TargetNeuronal acetylcholine receptor subunit alpha-7
LigandBDBM50296717
Substrate/Competitorn/a
Meas. Tech.ChEMBL_582484 (CHEMBL1058161)
Ki 11±n/a nM
Citation O'Donnell, CJPeng, LO'Neill, BTArnold, EPMather, RJSands, SBShrikhande, ALebel, LASpracklin, DKNedza, FM Synthesis and SAR studies of 1,4-diazabicyclo[3.2.2]nonane phenyl carbamates--subtype selective, high affinity alpha7 nicotinic acetylcholine receptor agonists. Bioorg Med Chem Lett19:4747-51 (2009) 
 
Neuronal acetylcholine receptor subunit alpha-7
Name:Neuronal acetylcholine receptor subunit alpha-7
Type:Enzyme
Mol. Mass.:56502.44
Organism:Rattus norvegicus (Rat)
Description:Q05941
Residue:502
BDBM50296717
NameBDBM50296717
Synonyms:3-benzoylphenyl 1,4-diazabicyclo[3.2.2]nonane-4-carboxylate | CHEMBL561070
TypeSmall organic molecule
Emp. Form.C21H22N2O3
Mol. Mass.350.411
SMILESO=C(Oc1cccc(c1)C(=O)c1ccccc1)N1CCN2CCC1CC2