Reaction Details
TargetNeuronal acetylcholine receptor subunit alpha-3
LigandBDBM50329578
Substrate/Competitorn/a
Meas. Tech.ChEMBL_582488 (CHEMBL1058165)
IC50 15.6±n/a nM
Citation O'Donnell, CJPeng, LO'Neill, BTArnold, EPMather, RJSands, SBShrikhande, ALebel, LASpracklin, DKNedza, FM Synthesis and SAR studies of 1,4-diazabicyclo[3.2.2]nonane phenyl carbamates--subtype selective, high affinity alpha7 nicotinic acetylcholine receptor agonists. Bioorg Med Chem Lett19:4747-51 (2009) 
 
Neuronal acetylcholine receptor subunit alpha-3
Name:Neuronal acetylcholine receptor subunit alpha-3
Type:Enzyme Catalytic Domain
Mol. Mass.:57479.03
Organism:Homo sapiens (Human)
Description:Cholinergic, Nicotinic Alpha3Beta2 0 HUMAN::P32297
Residue:505
BDBM50329578
NameBDBM50329578
Synonyms:(-)-9-Bromocytisine 3-bromocytisine | CHEMBL365956
TypeSmall organic molecule
Emp. Form.C11H13BrN2O
Mol. Mass.269.138
SMILESBrc1ccc2[C@H]3CNC[C@H](C3)Cn2c1=O