Reaction Details
TargetNeuronal acetylcholine receptor subunit alpha-4
LigandBDBM50296730
Substrate/Competitorn/a
Meas. Tech.ChEMBL_582486 (CHEMBL1058163)
IC50 1040±n/a nM
Citation O'Donnell, CJPeng, LO'Neill, BTArnold, EPMather, RJSands, SBShrikhande, ALebel, LASpracklin, DKNedza, FM Synthesis and SAR studies of 1,4-diazabicyclo[3.2.2]nonane phenyl carbamates--subtype selective, high affinity alpha7 nicotinic acetylcholine receptor agonists. Bioorg Med Chem Lett19:4747-51 (2009) 
 
Neuronal acetylcholine receptor subunit alpha-4
Name:Neuronal acetylcholine receptor subunit alpha-4
Type:Enzyme
Mol. Mass.:70196.44
Organism:Rattus norvegicus (Rat)
Description:P09483
Residue:630
BDBM50296730
NameBDBM50296730
Synonyms:CHEMBL563848 | phenyl 1,4-diazabicyclo[3.2.2]nonane-4-carboxylate
TypeSmall organic molecule
Emp. Form.C14H18N2O2
Mol. Mass.246.3049
SMILESO=C(Oc1ccccc1)N1CCN2CCC1CC2