Reaction Details
TargetKappa-type opioid receptor
LigandBDBM50296868
Substrate/Competitorn/a
Meas. Tech.ChEMBL_580503 (CHEMBL1053217)
EC50 67±n/a nM
Citation Li, FGaob, LYin, CChen, JLiu, JXie, XZhang, A Synthesis and opioid receptor activity of indolopropellanes. Bioorg Med Chem Lett19:4603-6 (2009) 
 
Kappa-type opioid receptor
Name:Kappa-type opioid receptor
Type:G Protein-Coupled Receptor (GPCR)
Mol. Mass.:42648.76
Organism:Homo sapiens (Human)
Description:P41145
Residue:380
BDBM50296868
NameBDBM50296868
Synonyms:(1S,13R)-22-(cyclopropylmethyl)-10,22-diazahexacyclo[11.7.4.0^{1,13}.0^{3,11}.0^{4,9}.0^{14,19}]tetracosa-3(11),4(9),5,7,14(19),15,17-heptaen-16-ol | CHEMBL562340
TypeSmall organic molecule
Emp. Form.C26H28N2O
Mol. Mass.384.5133
SMILESOc1ccc2C[C@@]34CN(CC5CC5)CC[C@@]3(Cc3[nH]c5ccccc5c3C4)c2c1