Reaction Details
TargetMu-type opioid receptor
LigandBDBM50076501
Substrate/Competitorn/a
Meas. Tech.ChEMBL_580497 (CHEMBL1052524)
Ki 1850±n/a nM
Citation Li, FGaob, LYin, CChen, JLiu, JXie, XZhang, A Synthesis and opioid receptor activity of indolopropellanes. Bioorg Med Chem Lett19:4603-6 (2009) 
 
Mu-type opioid receptor
Name:Mu-type opioid receptor
Type:G Protein-Coupled Receptor (GPCR)
Mol. Mass.:44789.51
Organism:Homo sapiens (Human)
Description:P35372
Residue:400
BDBM50076501
NameBDBM50076501
Synonyms:19-methoxy-24-methyl-4,24-diazahexacyclo[12.7.3.01,13.03,11.05,10.016,21]tetracosa-3(11),5(10),6,8,16,18,20-heptaene-13,20-diol | CHEMBL416647
TypeSmall organic molecule
Emp. Form.C24H26N2O3
Mol. Mass.390.4748
SMILESCOc1ccc2C[C@H]3N(C)CC[C@@]4(Cc5[nH]c6ccccc6c5C[C@@]34O)c2c1O