Reaction Details
TargetKappa-type opioid receptor
LigandBDBM50296864
Substrate/Competitorn/a
Meas. Tech.ChEMBL_580498 (CHEMBL1052525)
Ki 3810±n/a nM
Citation Li, FGaob, LYin, CChen, JLiu, JXie, XZhang, A Synthesis and opioid receptor activity of indolopropellanes. Bioorg Med Chem Lett19:4603-6 (2009) 
 
Kappa-type opioid receptor
Name:Kappa-type opioid receptor
Type:G Protein-Coupled Receptor (GPCR)
Mol. Mass.:42648.76
Organism:Homo sapiens (Human)
Description:P41145
Residue:380
BDBM50296864
NameBDBM50296864
Synonyms:(1S,13R)-16-methoxy-10,22-dimethyl-10,22-diazahexacyclo[11.7.4.0^{1,13}.0^{3,11}.0^{4,9}.0^{14,19}]tetracosa-3(11),4(9),5,7,14(19),15,17-heptaene | CHEMBL557252
TypeSmall organic molecule
Emp. Form.C25H28N2O
Mol. Mass.372.5026
SMILESCOc1ccc2C[C@@]34CN(C)CC[C@@]3(Cc3c(C4)c4ccccc4n3C)c2c1