Reaction Details
TargetKappa-type opioid receptor
LigandBDBM50296866
Substrate/Competitorn/a
Meas. Tech.ChEMBL_580498 (CHEMBL1052525)
Ki 1190±n/a nM
Citation Li, FGaob, LYin, CChen, JLiu, JXie, XZhang, A Synthesis and opioid receptor activity of indolopropellanes. Bioorg Med Chem Lett19:4603-6 (2009) 
 
Kappa-type opioid receptor
Name:Kappa-type opioid receptor
Type:G Protein-Coupled Receptor (GPCR)
Mol. Mass.:42648.76
Organism:Homo sapiens (Human)
Description:P41145
Residue:380
BDBM50296866
NameBDBM50296866
Synonyms:(1S,13R)-22-methyl-10,22-diazahexacyclo[11.7.4.0^{1,13}.0^{3,11}.0^{4,9}.0^{14,19}]tetracosa-3(11),4(9),5,7,14(19),15,17-heptaen-16-ol | CHEMBL562139
TypeSmall organic molecule
Emp. Form.C23H24N2O
Mol. Mass.344.4495
SMILESCN1CC[C@]23Cc4[nH]c5ccccc5c4C[C@]2(Cc2ccc(O)cc32)C1