Reaction Details
TargetKappa-type opioid receptor
LigandBDBM50296867
Substrate/Competitorn/a
Meas. Tech.ChEMBL_580498 (CHEMBL1052525)
EC50 62±n/a nM
Citation Li, FGaob, LYin, CChen, JLiu, JXie, XZhang, A Synthesis and opioid receptor activity of indolopropellanes. Bioorg Med Chem Lett19:4603-6 (2009) 
 
Kappa-type opioid receptor
Name:Kappa-type opioid receptor
Type:G Protein-Coupled Receptor (GPCR)
Mol. Mass.:42648.76
Organism:Homo sapiens (Human)
Description:P41145
Residue:380
BDBM50296867
NameBDBM50296867
Synonyms:(1S,13R)-10,22-dimethyl-10,22-diazahexacyclo[11.7.4.0^{1,13}.0^{3,11}.0^{4,9}.0^{14,19}]tetracosa-3(11),4(9),5,7,14(19),15,17-heptaen-16-ol | CHEMBL557937
TypeSmall organic molecule
Emp. Form.C24H26N2O
Mol. Mass.358.476
SMILESCN1CC[C@]23Cc4c(C[C@]2(Cc2ccc(O)cc32)C1)c1ccccc1n4C