Reaction Details
TargetSodium-dependent noradrenaline transporter
LigandBDBM50124566
Substrate/Competitorn/a
Meas. Tech.ChEMBL_583225 (CHEMBL1055024)
IC50 3.2±n/a nM
Citation Zhang, PTerefenko, EABray, JDeecher, DFensome, AHarrison, JKim, CKoury, EMark, LMcComas, CCMugford, CATrybulski, EJVu, ATWhiteside, GTMahaney, PE 1- or 3-(3-Amino-2-hydroxy-1-phenyl propyl)-1,3-dihydro-2H-benzimidazol-2-ones: potent, selective, and orally efficacious norepinephrine reuptake inhibitors. J Med Chem52:5703-11 (2009) 
 
Sodium-dependent noradrenaline transporter
Name:Sodium-dependent noradrenaline transporter
Type:Multi-pass membrane protein
Mol. Mass.:69337.72
Organism:Homo sapiens (Human)
Description:P23975
Residue:617
BDBM50124566
NameBDBM50124566
Synonyms:(R)-2-((R)-(2-ethoxyphenoxy)(phenyl)methyl)morpholine 2-((2-ethoxyphenoxy)(phenyl)methyl)morpholine 2-[2-ethoxyphenoxy(phenyl)methyl]-1,4-oxazinane REBOXETINE | rac-syn-2-((2-ethoxyphenoxy)(phenyl)methyl)morpholine
TypeSmall organic molecule
Emp. Form.C19H23NO3
Mol. Mass.313.3908
SMILESCCOc1ccccc1OC(C1CNCCO1)c1ccccc1