Reaction Details
TargetSodium-dependent noradrenaline transporter
LigandBDBM50297352
Substrate/Competitorn/a
Meas. Tech.ChEMBL_583226 (CHEMBL1055025)
IC50 4.1±n/a nM
Citation Zhang, PTerefenko, EABray, JDeecher, DFensome, AHarrison, JKim, CKoury, EMark, LMcComas, CCMugford, CATrybulski, EJVu, ATWhiteside, GTMahaney, PE 1- or 3-(3-Amino-2-hydroxy-1-phenyl propyl)-1,3-dihydro-2H-benzimidazol-2-ones: potent, selective, and orally efficacious norepinephrine reuptake inhibitors. J Med Chem52:5703-11 (2009) 
 
Sodium-dependent noradrenaline transporter
Name:Sodium-dependent noradrenaline transporter
Type:Multi-pass membrane protein
Mol. Mass.:69337.72
Organism:Homo sapiens (Human)
Description:P23975
Residue:617
BDBM50297352
NameBDBM50297352
Synonyms:4-Fluoro-3-[(1S,2R)-1-(3-fluorophenyl)-2-hydroxy-3-(methylamino)-propyl]-1-isopropyl-1,3-dihydro-2H-benzimidazol-2-one | CHEMBL551474
TypeSmall organic molecule
Emp. Form.C20H23F2N3O2
Mol. Mass.375.4123
SMILESCNC[C@@H](O)[C@H](c1cccc(F)c1)n1c2c(F)cccc2n(C(C)C)c1=O