Reaction Details
TargetSodium-dependent dopamine transporter
LigandBDBM50005536
Substrate/Competitorn/a
Meas. Tech.ChEMBL_583229 (CHEMBL1055028)
Ki 22.1±n/a nM
Citation Zhang, PTerefenko, EABray, JDeecher, DFensome, AHarrison, JKim, CKoury, EMark, LMcComas, CCMugford, CATrybulski, EJVu, ATWhiteside, GTMahaney, PE 1- or 3-(3-Amino-2-hydroxy-1-phenyl propyl)-1,3-dihydro-2H-benzimidazol-2-ones: potent, selective, and orally efficacious norepinephrine reuptake inhibitors. J Med Chem52:5703-11 (2009) 
 
Sodium-dependent dopamine transporter
Name:Sodium-dependent dopamine transporter
Type:Multi-pass membrane protein
Mol. Mass.:68497.11
Organism:Homo sapiens (Human)
Description:Q01959
Residue:620
BDBM50005536
NameBDBM50005536
Synonyms:42-548 5-(4-chlorophenyl)-3,5-dihydro-2H-imidazo[2,1-a]isoindol-5-ol CHEMBL781 Mazanor mazindole
TypeSmall organic molecule
Emp. Form.C16H13ClN2O
Mol. Mass.284.74
SMILESOC1(N2CCN=C2c2ccccc12)c1ccc(Cl)cc1