Reaction Details
TargetHydroxycarboxylic acid receptor 2
LigandBDBM50378119
Substrate/Competitorn/a
Meas. Tech.ChEMBL_585071 (CHEMBL1054337)
IC50 150±n/a nM
Citation Schmidt, DSmenton, ARaghavan, SCarballo-Jane, ELubell, SCiecko, THolt, TGWolff, MTaggart, AWilsie, LKrsmanovic, MRen, NBlom, DCheng, KMcCann, PEGerard Waters, MTata, JColletti, S Pyrazole acids as niacin receptor agonists for the treatment of dyslipidemia. Bioorg Med Chem Lett19:4768-72 (2009) 
 
Hydroxycarboxylic acid receptor 2
Name:Hydroxycarboxylic acid receptor 2
Type:G Protein-Coupled Receptor (GPCR)
Mol. Mass.:41868.22
Organism:Homo sapiens (Human)
Description:Membranes from CHO cells expressing the recombinant human GPR109A were used in competition binding assay.
Residue:363
BDBM50378119
NameBDBM50378119
Synonyms:CHEMBL1204125
TypeSmall organic molecule
Emp. Form.C13H10FN7
Mol. Mass.283.2638
SMILESFc1ncccc1C1CCC2=C(C1)C(N=N2)=C1N=NN=N1