Reaction Details
TargetMyosin light chain kinase, smooth muscle
LigandBDBM50366348
Substrate/Competitorn/a
Meas. Tech.ChEMBL_587164 (CHEMBL1060228)
Ki 97000±n/a nM
Citation Engh, RAGirod, AKinzel, VHuber, RBossemeyer, D Crystal structures of catalytic subunit of cAMP-dependent protein kinase in complex with isoquinolinesulfonyl protein kinase inhibitors H7, H8, and H89. Structural implications for selectivity. J Biol Chem271:26157-64 (1996) Myosin light chain kinase, smooth muscle
Name:Myosin light chain kinase, smooth muscle
Type:Enzyme
Mol. Mass.:210423.57
Organism:Gallus gallus (chicken)
Description:n/a
Residue:1906
BDBM50366348
NameBDBM50366348
Synonyms:CHEMBL1233654
TypeSmall organic molecule
Emp. Form.C14H17N3O2S
Mol. Mass.291.369
SMILESC[C@H]1CNCCN1S(=O)(=O)c1cccc2cnccc12