Reaction Details
TargetDual specificity tyrosine-phosphorylation-regulated kinase 1A
LigandBDBM100152
Substrate/Competitorn/a
Meas. Tech.ChEMBL_586736 (CHEMBL1062880)
IC50 80±n/a nM
Citation Bain, JPlater, LElliott, MShpiro, NHastie, CJMcLauchlan, HKlevernic, IArthur, JSAlessi, DRCohen, P The selectivity of protein kinase inhibitors: a further update. Biochem J408:297-315 (2007) 
 
Dual specificity tyrosine-phosphorylation-regulated kinase 1A
Name:Dual specificity tyrosine-phosphorylation-regulated kinase 1A
Type:Enzyme
Mol. Mass.:85616.61
Organism:Homo sapiens (Human)
Description:Q13627
Residue:763
BDBM100152
NameBDBM100152
Synonyms:7-methoxy-1-methyl-9H-beta-carboline;hydrochloride HARMINE MLS002153910 cid_5359389
TypeSmall organic molecule
Emp. Form.C13H12N2O
Mol. Mass.212.2472
SMILESCOc1ccc2c(c1)[nH]c1c(C)nccc21