Reaction Details
TargetSerine/threonine-protein kinase BRSK2
LigandBDBM50298223
Substrate/Competitorn/a
Meas. Tech.ChEMBL_587227 (CHEMBL1061990)
IC50 1100±n/a nM
Citation Bain, JPlater, LElliott, MShpiro, NHastie, CJMcLauchlan, HKlevernic, IArthur, JSAlessi, DRCohen, P The selectivity of protein kinase inhibitors: a further update. Biochem J408:297-315 (2007) 
 
Serine/threonine-protein kinase BRSK2
Name:Serine/threonine-protein kinase BRSK2
Type:PROTEIN
Mol. Mass.:81657.07
Organism:Homo sapiens (Human)
Description:ChEMBL_586949
Residue:736
BDBM50298223
NameBDBM50298223
Synonyms:CGP-57380 CHEMBL576817 | N-(4-fluorophenyl)-3H-pyrazolo[3,4-d]pyrimidine-3,4-diamine
TypeSmall organic molecule
Emp. Form.C11H9FN6
Mol. Mass.244.2278
SMILESNc1ncnc2n[nH]c(Nc3ccc(F)cc3)c12