Reaction Details
TargetMAP kinase-interacting serine/threonine-protein kinase 2
LigandBDBM50298223
Substrate/Competitorn/a
Meas. Tech.ChEMBL_586742 (CHEMBL1062886)
IC50 1600±n/a nM
Citation Bain, JPlater, LElliott, MShpiro, NHastie, CJMcLauchlan, HKlevernic, IArthur, JSAlessi, DRCohen, P The selectivity of protein kinase inhibitors: a further update. Biochem J408:297-315 (2007) 
 
MAP kinase-interacting serine/threonine-protein kinase 2
Name:MAP kinase-interacting serine/threonine-protein kinase 2
Type:Protein
Mol. Mass.:51870.79
Organism:Homo sapiens (Human)
Description:Q9HBH9
Residue:465
BDBM50298223
NameBDBM50298223
Synonyms:CGP-57380 CHEMBL576817 | N-(4-fluorophenyl)-3H-pyrazolo[3,4-d]pyrimidine-3,4-diamine
TypeSmall organic molecule
Emp. Form.C11H9FN6
Mol. Mass.244.2278
SMILESNc1ncnc2n[nH]c(Nc3ccc(F)cc3)c12