Reaction Details
TargetInhibitor of nuclear factor kappa-B kinase subunit beta
LigandBDBM50130248
Substrate/Competitorn/a
Meas. Tech.ChEMBL_586740 (CHEMBL1062884)
IC50 250±n/a nM
Citation Bain, JPlater, LElliott, MShpiro, NHastie, CJMcLauchlan, HKlevernic, IArthur, JSAlessi, DRCohen, P The selectivity of protein kinase inhibitors: a further update. Biochem J408:297-315 (2007) 
 
Inhibitor of nuclear factor kappa-B kinase subunit beta
Name:Inhibitor of nuclear factor kappa-B kinase subunit beta
Type:Serine/threonine-protein kinase
Mol. Mass.:86554.39
Organism:Homo sapiens (Human)
Description:GST-tagged IKK-2 was expressed in High Five cells and purified.
Residue:756
BDBM50130248
NameBDBM50130248
Synonyms:CHEMBL79004 PS-1145
TypeSmall organic molecule
Emp. Form.C17H11ClN4O
Mol. Mass.322.748
SMILESClc1cc(NC(=O)c2cccnc2)c2[nH]c3cnccc3c2c1