Reaction Details
TargetDual specificity tyrosine-phosphorylation-regulated kinase 3
LigandBDBM100152
Substrate/Competitorn/a
Meas. Tech.ChEMBL_586500 (CHEMBL1051268)
IC50 800±n/a nM
Citation Bain, JPlater, LElliott, MShpiro, NHastie, CJMcLauchlan, HKlevernic, IArthur, JSAlessi, DRCohen, P The selectivity of protein kinase inhibitors: a further update. Biochem J408:297-315 (2007) 
 
Dual specificity tyrosine-phosphorylation-regulated kinase 3
Name:Dual specificity tyrosine-phosphorylation-regulated kinase 3
Type:PROTEIN
Mol. Mass.:65747.26
Organism:Homo sapiens (Human)
Description:ChEMBL_1508026
Residue:588
BDBM100152
NameBDBM100152
Synonyms:7-methoxy-1-methyl-9H-beta-carboline;hydrochloride HARMINE MLS002153910 cid_5359389
TypeSmall organic molecule
Emp. Form.C13H12N2O
Mol. Mass.212.2472
SMILESCOc1ccc2c(c1)[nH]c1c(C)nccc21