Reaction Details
TargetProto-oncogene tyrosine-protein kinase LCK
LigandBDBM50153835
Substrate/Competitorn/a
Meas. Tech.ChEMBL_587115 (CHEMBL1051325)
IC50 570±n/a nM
Citation Bain, JPlater, LElliott, MShpiro, NHastie, CJMcLauchlan, HKlevernic, IArthur, JSAlessi, DRCohen, P The selectivity of protein kinase inhibitors: a further update. Biochem J408:297-315 (2007) 
 
Proto-oncogene tyrosine-protein kinase LCK
Name:Proto-oncogene tyrosine-protein kinase LCK
Type:PROTEIN
Mol. Mass.:57927.84
Organism:Mus musculus
Description:ChEMBL_806408
Residue:509
BDBM50153835
NameBDBM50153835
Synonyms:1-(3-dimethylaminophenylcarboxamido)-3-(4-hydroxyphenylcarboxamido)-4-methylbenzene CHEMBL186526 ZM-336372
TypeSmall organic molecule
Emp. Form.C23H23N3O3
Mol. Mass.389.447
SMILESCN(C)c1cccc(c1)C(=O)Nc1ccc(C)c(NC(=O)c2ccc(O)cc2)c1