Reaction Details
TargetSerine/threonine-protein kinase pim-1
LigandBDBM50130248
Substrate/Competitorn/a
Meas. Tech.ChEMBL_586377 (CHEMBL1061942)
IC50 1100±n/a nM
Citation Bain, JPlater, LElliott, MShpiro, NHastie, CJMcLauchlan, HKlevernic, IArthur, JSAlessi, DRCohen, P The selectivity of protein kinase inhibitors: a further update. Biochem J408:297-315 (2007) 
 
Serine/threonine-protein kinase pim-1
Name:Serine/threonine-protein kinase pim-1
Type:Protein
Mol. Mass.:35681.82
Organism:Homo sapiens (Human)
Description:P11309
Residue:313
BDBM50130248
NameBDBM50130248
Synonyms:CHEMBL79004 PS-1145
TypeSmall organic molecule
Emp. Form.C17H11ClN4O
Mol. Mass.322.748
SMILESClc1cc(NC(=O)c2cccnc2)c2[nH]c3cnccc3c2c1