Reaction Details
TargetcAMP-dependent protein kinase catalytic subunit alpha
LigandBDBM50298225
Substrate/Competitorn/a
Meas. Tech.ChEMBL_586378 (CHEMBL1061943)
IC50 500±n/a nM
Citation Bain, JPlater, LElliott, MShpiro, NHastie, CJMcLauchlan, HKlevernic, IArthur, JSAlessi, DRCohen, P The selectivity of protein kinase inhibitors: a further update. Biochem J408:297-315 (2007) 
 
cAMP-dependent protein kinase catalytic subunit alpha
Name:cAMP-dependent protein kinase catalytic subunit alpha
Type:Enzyme Catalytic Subunit
Mol. Mass.:40598.73
Organism:Homo sapiens (Human)
Description:n/a
Residue:351
BDBM50298225
NameBDBM50298225
Synonyms:CHEMBL2069955 NM-PP1 US11247972, Compound 5d | US9765037, Compound 5d
TypeSmall organic molecule
Emp. Form.C20H21N5
Mol. Mass.331.4142
SMILESCC(C)(C)n1nc(Cc2cccc3ccccc23)c2c(N)ncnc12