Reaction Details
TargetReceptor-interacting serine/threonine-protein kinase 2
LigandBDBM50142887
Substrate/Competitorn/a
Meas. Tech.ChEMBL_587119 (CHEMBL1051329)
IC50 19±n/a nM
Citation Bain, JPlater, LElliott, MShpiro, NHastie, CJMcLauchlan, HKlevernic, IArthur, JSAlessi, DRCohen, P The selectivity of protein kinase inhibitors: a further update. Biochem J408:297-315 (2007) 
 
Receptor-interacting serine/threonine-protein kinase 2
Name:Receptor-interacting serine/threonine-protein kinase 2
Type:Protein
Mol. Mass.:61201.30
Organism:Homo sapiens (Human)
Description:n/a
Residue:540
BDBM50142887
NameBDBM50142887
Synonyms:1-(tert-butyl)-3-(4-chlorophenyl)-4-aminopyrazolo[3,4-d]pyrimidine 1-tert-butyl-3-(4-chlorophenyl)-1H-pyrazolo[3,4-d]pyrimidin-4-amine 4-amino-5-(4-chlorophenyl)-7-(tert-butyl)pyrazolo[3,4-d]pyrimidine CHEMBL406845 US10544104, Compound 146 US11701353, PP2 (Pfizer) cid_4878
TypeSmall organic molecule
Emp. Form.C15H16ClN5
Mol. Mass.301.774
SMILESCC(C)(C)n1nc(-c2ccc(Cl)cc2)c2c(N)ncnc12