Reaction Details
TargetReceptor-interacting serine/threonine-protein kinase 2
LigandBDBM50095227
Substrate/Competitorn/a
Meas. Tech.ChEMBL_587119 (CHEMBL1051329)
IC50 26±n/a nM
Citation Bain, JPlater, LElliott, MShpiro, NHastie, CJMcLauchlan, HKlevernic, IArthur, JSAlessi, DRCohen, P The selectivity of protein kinase inhibitors: a further update. Biochem J408:297-315 (2007) 
 
Receptor-interacting serine/threonine-protein kinase 2
Name:Receptor-interacting serine/threonine-protein kinase 2
Type:Protein
Mol. Mass.:61201.30
Organism:Homo sapiens (Human)
Description:n/a
Residue:540
BDBM50095227
NameBDBM50095227
Synonyms:(6,7-Dimethoxy-quinazolin-4-yl)-(4-phenoxy-phenyl)-amine CHEMBL97771 | US10548897, Compound 2
TypeSmall organic molecule
Emp. Form.C22H19N3O3
Mol. Mass.373.4046
SMILESCOc1cc2ncnc(Nc3ccc(Oc4ccccc4)cc3)c2cc1OC