Reaction Details
TargetProto-oncogene tyrosine-protein kinase Src
LigandBDBM50095227
Substrate/Competitorn/a
Meas. Tech.ChEMBL_586868 (CHEMBL1051363)
IC50 180±n/a nM
Citation Bain, JPlater, LElliott, MShpiro, NHastie, CJMcLauchlan, HKlevernic, IArthur, JSAlessi, DRCohen, P The selectivity of protein kinase inhibitors: a further update. Biochem J408:297-315 (2007) 
 
Proto-oncogene tyrosine-protein kinase Src
Name:Proto-oncogene tyrosine-protein kinase Src
Type:Tyr protein kinase
Mol. Mass.:60015.36
Organism:Gallus gallus (Chicken)
Description:P00523
Residue:533
BDBM50095227
NameBDBM50095227
Synonyms:(6,7-Dimethoxy-quinazolin-4-yl)-(4-phenoxy-phenyl)-amine CHEMBL97771 | US10548897, Compound 2
TypeSmall organic molecule
Emp. Form.C22H19N3O3
Mol. Mass.373.4046
SMILESCOc1cc2ncnc(Nc3ccc(Oc4ccccc4)cc3)c2cc1OC