Reaction Details
TargetSodium-dependent noradrenaline transporter
LigandBDBM50302909
Substrate/Competitorn/a
Meas. Tech.ChEMBL_595697 (CHEMBL1041760)
Ki 2580±n/a nM
Citation Carroll, FIBlough, BEAbraham, PMills, ACHolleman, JAWolckenhauer, SADecker, AMLandavazo, AMcElroy, KTNavarro, HAGatch, MBForster, MJ Synthesis and biological evaluation of bupropion analogues as potential pharmacotherapies for cocaine addiction. J Med Chem52:6768-81 (2009) 
 
Sodium-dependent noradrenaline transporter
Name:Sodium-dependent noradrenaline transporter
Type:Multi-pass membrane protein
Mol. Mass.:69337.72
Organism:Homo sapiens (Human)
Description:P23975
Residue:617
BDBM50302909
NameBDBM50302909
Synonyms:2-(N-tert-Butylamino)-3'-chlorooctanophenone | CHEMBL565593
TypeSmall organic molecule
Emp. Form.C18H28ClNO
Mol. Mass.309.874
SMILESCCCCCCC(NC(C)(C)C)C(=O)c1cccc(Cl)c1