Reaction Details
TargetSodium-dependent serotonin transporter
LigandBDBM50302918
Substrate/Competitorn/a
Meas. Tech.ChEMBL_595696 (CHEMBL1041759)
Ki 1480±n/a nM
Citation Carroll, FIBlough, BEAbraham, PMills, ACHolleman, JAWolckenhauer, SADecker, AMLandavazo, AMcElroy, KTNavarro, HAGatch, MBForster, MJ Synthesis and biological evaluation of bupropion analogues as potential pharmacotherapies for cocaine addiction. J Med Chem52:6768-81 (2009) 
 
Sodium-dependent serotonin transporter
Name:Sodium-dependent serotonin transporter
Type:Multi-pass membrane protein
Mol. Mass.:70322.51
Organism:Homo sapiens (Human)
Description:P31645
Residue:630
BDBM50302918
NameBDBM50302918
Synonyms:2-(N-tert-Butylamino)-3',4'-dichloropropiophenone CHEMBL568140
TypeSmall organic molecule
Emp. Form.C13H17Cl2NO
Mol. Mass.274.186
SMILESCC(NC(C)(C)C)C(=O)c1ccc(Cl)c(Cl)c1