Reaction Details
TargetSodium-dependent dopamine transporter
LigandBDBM50048392
Substrate/Competitorn/a
Meas. Tech.ChEMBL_595695 (CHEMBL1041758)
Ki 871±n/a nM
Citation Carroll, FIBlough, BEAbraham, PMills, ACHolleman, JAWolckenhauer, SADecker, AMLandavazo, AMcElroy, KTNavarro, HAGatch, MBForster, MJ Synthesis and biological evaluation of bupropion analogues as potential pharmacotherapies for cocaine addiction. J Med Chem52:6768-81 (2009) 
 
Sodium-dependent dopamine transporter
Name:Sodium-dependent dopamine transporter
Type:Multi-pass membrane protein
Mol. Mass.:68497.11
Organism:Homo sapiens (Human)
Description:Q01959
Residue:620
BDBM50048392
NameBDBM50048392
Synonyms:2-(tert-butylamino)-1-(3-chlorophenyl)propan-1-one BUPROPION HYDROCHLORIDE US9944618, Compound ID No. 176
TypeSmall organic molecule
Emp. Form.C13H18ClNO
Mol. Mass.239.741
SMILESCC(NC(C)(C)C)C(=O)c1cccc(Cl)c1