Reaction Details
TargetSodium-dependent serotonin transporter
LigandBDBM50302910
Substrate/Competitorn/a
Meas. Tech.ChEMBL_595696 (CHEMBL1041759)
Ki 4170±n/a nM
Citation Carroll, FIBlough, BEAbraham, PMills, ACHolleman, JAWolckenhauer, SADecker, AMLandavazo, AMcElroy, KTNavarro, HAGatch, MBForster, MJ Synthesis and biological evaluation of bupropion analogues as potential pharmacotherapies for cocaine addiction. J Med Chem52:6768-81 (2009) 
 
Sodium-dependent serotonin transporter
Name:Sodium-dependent serotonin transporter
Type:Multi-pass membrane protein
Mol. Mass.:70322.51
Organism:Homo sapiens (Human)
Description:P31645
Residue:630
BDBM50302910
NameBDBM50302910
Synonyms:1-(4-bromophenyl)-2-(tert-butylamino)propan-1-one CHEMBL566001
TypeSmall organic molecule
Emp. Form.C13H18BrNO
Mol. Mass.284.192
SMILESCC(NC(C)(C)C)C(=O)c1ccc(Br)cc1