Reaction Details
TargetRibosomal protein S6 kinase alpha-2
LigandBDBM25045
Substrate/Competitorn/a
Meas. Tech.ChEMBL_586996 (CHEMBL1062786)
Kd>10000±n/a nM
Citation Karaman, MWHerrgard, STreiber, DKGallant, PAtteridge, CECampbell, BTChan, KWCiceri, PDavis, MIEdeen, PTFaraoni, RFloyd, MHunt, JPLockhart, DJMilanov, ZVMorrison, MJPallares, GPatel, HKPritchard, SWodicka, LMZarrinkar, PP A quantitative analysis of kinase inhibitor selectivity. Nat Biotechnol26:127-32 (2008) 
 
Ribosomal protein S6 kinase alpha-2
Name:Ribosomal protein S6 kinase alpha-2
Type:Serine/threonine-protein kinase
Mol. Mass.:83259.46
Organism:Homo sapiens (Human)
Description:n/a
Residue:733
BDBM25045
NameBDBM25045
Synonyms:3-(4-morpholin-4-ylpyrido[2,3]furo[2,4-b]pyrimidin-2-yl)phenol 3-(4-morpholinopyrido[2,3]furo[2,4-b]pyrimidin-2-yl)phenol 3-[6-(morpholin-4-yl)-8-oxa-3,5,10-triazatricyclo[7.4.0.0^{2,7}]trideca-1(9),2,4,6,10,12-hexaen-4-yl]phenol PI-103 cid_9884685 pyridofuropyrimidine derivative, 2
TypeSmall organic molecule
Emp. Form.C19H16N4O3
Mol. Mass.348.3553
SMILESOc1cccc(c1)-c1nc(N2CCOCC2)c2oc3ncccc3c2n1