Reaction Details
TargetRibosomal protein S6 kinase alpha-4
LigandBDBM21
Substrate/Competitorn/a
Meas. Tech.ChEMBL_586491 (CHEMBL1051259)
Kd>10000±n/a nM
Citation Karaman, MWHerrgard, STreiber, DKGallant, PAtteridge, CECampbell, BTChan, KWCiceri, PDavis, MIEdeen, PTFaraoni, RFloyd, MHunt, JPLockhart, DJMilanov, ZVMorrison, MJPallares, GPatel, HKPritchard, SWodicka, LMZarrinkar, PP A quantitative analysis of kinase inhibitor selectivity. Nat Biotechnol26:127-32 (2008) 
 
Ribosomal protein S6 kinase alpha-4
Name:Ribosomal protein S6 kinase alpha-4
Type:Serine/threonine-protein kinase
Mol. Mass.:85620.38
Organism:Homo sapiens (Human)
Description:Recombinant MSK2 was phosphorylated by incubation with active p38alpha before assays.
Residue:772
BDBM21
NameBDBM21
Synonyms:CHEMBL24828 VANDETANIB ZD6474 | cid_3081361
Typen/a
Emp. Form.C22H24BrFN4O2
Mol. Mass.475.354
SMILESCOc1cc2c(Nc3ccc(Br)cc3F)ncnc2cc1OCC1CCN(C)CC1