Reaction Details
TargetRibosomal protein S6 kinase alpha-1
LigandBDBM4851
Substrate/Competitorn/a
Meas. Tech.ChEMBL_586995 (CHEMBL1062785)
Kd>10000±n/a nM
Citation Karaman, MWHerrgard, STreiber, DKGallant, PAtteridge, CECampbell, BTChan, KWCiceri, PDavis, MIEdeen, PTFaraoni, RFloyd, MHunt, JPLockhart, DJMilanov, ZVMorrison, MJPallares, GPatel, HKPritchard, SWodicka, LMZarrinkar, PP A quantitative analysis of kinase inhibitor selectivity. Nat Biotechnol26:127-32 (2008) 
 
Ribosomal protein S6 kinase alpha-1
Name:Ribosomal protein S6 kinase alpha-1
Type:Serine/threonine-protein kinase
Mol. Mass.:82736.10
Organism:Homo sapiens (Human)
Description:n/a
Residue:735
BDBM4851
NameBDBM4851
Synonyms:(4-chlorophenyl)-[4-(4-pyridylmethyl)phthalazin-1-yl]amine CGP 79787 CHEMBL75232 N-(4-chlorophenyl)-4-(pyridin-4-ylmethyl)phthalazin-1-amine PTK787 cid_151194
TypeSmall organic molecule
Emp. Form.C20H15ClN4
Mol. Mass.346.813
SMILESClc1ccc(Nc2nnc(Cc3ccncc3)c3ccccc23)cc1