Reaction Details
TargetCasein kinase I isoform delta
LigandBDBM4851
Substrate/Competitorn/a
Meas. Tech.ChEMBL_586690 (CHEMBL1050829)
Kd>10000±n/a nM
Citation Karaman, MWHerrgard, STreiber, DKGallant, PAtteridge, CECampbell, BTChan, KWCiceri, PDavis, MIEdeen, PTFaraoni, RFloyd, MHunt, JPLockhart, DJMilanov, ZVMorrison, MJPallares, GPatel, HKPritchard, SWodicka, LMZarrinkar, PP A quantitative analysis of kinase inhibitor selectivity. Nat Biotechnol26:127-32 (2008) 
 
Casein kinase I isoform delta
Name:Casein kinase I isoform delta
Type:Enzyme
Mol. Mass.:47356.76
Organism:Homo sapiens (Human)
Description:P48730
Residue:415
BDBM4851
NameBDBM4851
Synonyms:(4-chlorophenyl)-[4-(4-pyridylmethyl)phthalazin-1-yl]amine CGP 79787 CHEMBL75232 N-(4-chlorophenyl)-4-(pyridin-4-ylmethyl)phthalazin-1-amine PTK787 cid_151194
TypeSmall organic molecule
Emp. Form.C20H15ClN4
Mol. Mass.346.813
SMILESClc1ccc(Nc2nnc(Cc3ccncc3)c3ccccc23)cc1