Reaction Details
TargetTRAF2 and NCK-interacting protein kinase
LigandBDBM26474
Substrate/Competitorn/a
Meas. Tech.ChEMBL_586729 (CHEMBL1062874)
Kd 310±n/a nM
Citation Karaman, MWHerrgard, STreiber, DKGallant, PAtteridge, CECampbell, BTChan, KWCiceri, PDavis, MIEdeen, PTFaraoni, RFloyd, MHunt, JPLockhart, DJMilanov, ZVMorrison, MJPallares, GPatel, HKPritchard, SWodicka, LMZarrinkar, PP A quantitative analysis of kinase inhibitor selectivity. Nat Biotechnol26:127-32 (2008) 
 
TRAF2 and NCK-interacting protein kinase
Name:TRAF2 and NCK-interacting protein kinase
Type:Protein
Mol. Mass.:154954.98
Organism:Homo sapiens (Human)
Description:Q9UKE5
Residue:1360
BDBM26474
NameBDBM26474
Synonyms:5-({4-[(2,3-dimethyl-2H-indazol-6-yl)(methyl)amino]pyrimidin-2-yl}amino)-2-methylbenzene-1-sulfonamide JMC514632 Compound 13 cid_10113978
TypeSmall organic molecule
Emp. Form.C21H23N7O2S
Mol. Mass.437.518
SMILESCN(c1ccc2c(C)n(C)nc2c1)c1ccnc(Nc2ccc(C)c(c2)S(N)(=O)=O)n1