Reaction Details
TargetSerine/threonine-protein kinase D1
LigandBDBM6866
Substrate/Competitorn/a
Meas. Tech.ChEMBL_587211 (CHEMBL1061155)
Kd 8400±n/a nM
Citation Karaman, MWHerrgard, STreiber, DKGallant, PAtteridge, CECampbell, BTChan, KWCiceri, PDavis, MIEdeen, PTFaraoni, RFloyd, MHunt, JPLockhart, DJMilanov, ZVMorrison, MJPallares, GPatel, HKPritchard, SWodicka, LMZarrinkar, PP A quantitative analysis of kinase inhibitor selectivity. Nat Biotechnol26:127-32 (2008) 
 
Serine/threonine-protein kinase D1
Name:Serine/threonine-protein kinase D1
Type:Serine/threonine-protein kinase
Mol. Mass.:101705.07
Organism:Homo sapiens (Human)
Description:gi_115529463
Residue:912
BDBM6866
NameBDBM6866
Synonyms:1-Acyl-1H-[1,2,4]triazole-3,5-diamine Analogue 3b 4-[[5-Amino-1-(2,6-difluorobenzoyl)-1H-1,2,4-triazol-3-yl]amino]-benzenesulfonamide JNJ-7706621 | cid_5330790
TypeSmall organic molecule
Emp. Form.C15H12F2N6O3S
Mol. Mass.394.356
SMILESNc1nc(Nc2ccc(cc2)S(N)(=O)=O)nn1C(=O)c1c(F)cccc1F